Information card for entry 7033813
Formula | C136 H149 Fe2 Mn4 N25 O20 |
Calculated formula | C136 H140 Fe2 Mn4 N25 O20 |
Title of publication | Synthesis, crystal structures and magnetic properties of mer-cyanideiron(iii)-based 1D heterobimetallic cyanide-bridged chiral coordination polymers. |
Authors of publication | Zhang, Daopeng; Zhuo, Shuping; Zhang, Hongyan; Wang, Ping; Jiang, Jianzhuang |
Journal of publication | Dalton transactions (Cambridge, England : 2003) |
Year of publication | 2015 |
Journal volume | 44 |
Journal issue | 10 |
Pages of publication | 4655 - 4664 |
a | 19.5297 ± 0.0005 Å |
b | 14.9492 ± 0.0004 Å |
c | 22.5824 ± 0.0005 Å |
α | 90° |
β | 98.188 ± 0.002° |
γ | 90° |
Cell volume | 6525.8 ± 0.3 Å3 |
Cell temperature | 293 ± 2 K |
Ambient diffraction temperature | 293 ± 2 K |
Number of distinct elements | 6 |
Space group number | 4 |
Hermann-Mauguin space group symbol | P 1 21 1 |
Hall space group symbol | P 2yb |
Residual factor for all reflections | 0.0853 |
Residual factor for significantly intense reflections | 0.0614 |
Weighted residual factors for significantly intense reflections | 0.1322 |
Weighted residual factors for all reflections included in the refinement | 0.1459 |
Goodness-of-fit parameter for all reflections included in the refinement | 1.015 |
Diffraction radiation wavelength | 0.71073 Å |
Diffraction radiation type | MoKα |