Information card for entry 7033834
Chemical name | Ru-Cl |
Formula | C28 H39 Cl2 N4 O2.5 Ru |
Calculated formula | C28 H39 Cl2 N4 O2.5 Ru |
Title of publication | Synthesis, characterisation and antibacterial activity of [(p-cym)RuX(L)](+/2+) (X = Cl, H2O; L = bpmo, bpms) complexes. |
Authors of publication | Tripathy, Suman Kumar; Taviti, Ashoka Chary; Dehury, Niranjan; Sahoo, Anupam; Pal, Satyanaryan; Beuria, Tushar Kant; Patra, Srikanta |
Journal of publication | Dalton transactions (Cambridge, England : 2003) |
Year of publication | 2015 |
Journal volume | 44 |
Journal issue | 11 |
Pages of publication | 5114 - 5124 |
a | 9.1776 ± 0.0009 Å |
b | 17.3678 ± 0.0017 Å |
c | 18.339 ± 0.0002 Å |
α | 90° |
β | 93.809 ± 0.011° |
γ | 90° |
Cell volume | 2916.7 ± 0.4 Å3 |
Cell temperature | 293 ± 2 K |
Ambient diffraction temperature | 293 ± 2 K |
Number of distinct elements | 6 |
Space group number | 14 |
Hermann-Mauguin space group symbol | P 1 21/n 1 |
Hall space group symbol | -P 2yn |
Residual factor for all reflections | 0.0715 |
Residual factor for significantly intense reflections | 0.0699 |
Weighted residual factors for significantly intense reflections | 0.1826 |
Weighted residual factors for all reflections included in the refinement | 0.184 |
Goodness-of-fit parameter for all reflections included in the refinement | 1.07 |
Diffraction radiation wavelength | 1.5418 Å |
Diffraction radiation type | CuKα |