Information card for entry 7033835
Chemical name | Ru_ani_aq |
Formula | C28 H38 Cl2 N4 O10 Ru |
Calculated formula | C28 H38 Cl2 N4 O10 Ru |
Title of publication | Synthesis, characterisation and antibacterial activity of [(p-cym)RuX(L)](+/2+) (X = Cl, H2O; L = bpmo, bpms) complexes. |
Authors of publication | Tripathy, Suman Kumar; Taviti, Ashoka Chary; Dehury, Niranjan; Sahoo, Anupam; Pal, Satyanaryan; Beuria, Tushar Kant; Patra, Srikanta |
Journal of publication | Dalton transactions (Cambridge, England : 2003) |
Year of publication | 2015 |
Journal volume | 44 |
Journal issue | 11 |
Pages of publication | 5114 - 5124 |
a | 9.5546 ± 0.0004 Å |
b | 10.6513 ± 0.0005 Å |
c | 15.9201 ± 0.0007 Å |
α | 86.556 ± 0.004° |
β | 87.525 ± 0.003° |
γ | 88.928 ± 0.004° |
Cell volume | 1615.53 ± 0.12 Å3 |
Cell temperature | 293 ± 2 K |
Ambient diffraction temperature | 293 ± 2 K |
Number of distinct elements | 6 |
Space group number | 2 |
Hermann-Mauguin space group symbol | P -1 |
Hall space group symbol | -P 1 |
Residual factor for all reflections | 0.0566 |
Residual factor for significantly intense reflections | 0.0435 |
Weighted residual factors for significantly intense reflections | 0.0972 |
Weighted residual factors for all reflections included in the refinement | 0.1084 |
Goodness-of-fit parameter for all reflections included in the refinement | 1.036 |
Diffraction radiation wavelength | 0.71073 Å |
Diffraction radiation type | MoKα |