Information card for entry 7033845
Formula | C28 H20 Br2 Hg N8 O2 |
Calculated formula | C28 H20 Br2 Hg N8 O2 |
Title of publication | Influence of N-heteroaromatic π-π stacking on supramolecular assembly and coordination geometry; effect of a single-atom change in the ligand. |
Authors of publication | Khavasi, Hamid Reza; Mir Mohammad Sadegh, Bahareh |
Journal of publication | Dalton transactions (Cambridge, England : 2003) |
Year of publication | 2015 |
Journal volume | 44 |
Journal issue | 12 |
Pages of publication | 5488 - 5502 |
a | 3.9332 ± 0.0009 Å |
b | 12.278 ± 0.003 Å |
c | 14.441 ± 0.003 Å |
α | 99.278 ± 0.019° |
β | 91.024 ± 0.018° |
γ | 92.56 ± 0.02° |
Cell volume | 687.3 ± 0.3 Å3 |
Cell temperature | 298 ± 2 K |
Ambient diffraction temperature | 298 ± 2 K |
Number of distinct elements | 6 |
Space group number | 2 |
Hermann-Mauguin space group symbol | P -1 |
Hall space group symbol | -P 1 |
Residual factor for all reflections | 0.0952 |
Residual factor for significantly intense reflections | 0.0681 |
Weighted residual factors for significantly intense reflections | 0.1405 |
Weighted residual factors for all reflections included in the refinement | 0.1754 |
Goodness-of-fit parameter for all reflections included in the refinement | 0.994 |
Diffraction radiation wavelength | 0.71073 Å |
Diffraction radiation type | MoKα |