Information card for entry 7033846
Formula | C14 H10 Hg I2 N4 O |
Calculated formula | C14 H10 Hg I2 N4 O |
SMILES | c1c[n](cc(C(=O)Nc2ccc3ccccc3n2)n1)[Hg](I)I |
Title of publication | Influence of N-heteroaromatic π-π stacking on supramolecular assembly and coordination geometry; effect of a single-atom change in the ligand. |
Authors of publication | Khavasi, Hamid Reza; Mir Mohammad Sadegh, Bahareh |
Journal of publication | Dalton transactions (Cambridge, England : 2003) |
Year of publication | 2015 |
Journal volume | 44 |
Journal issue | 12 |
Pages of publication | 5488 - 5502 |
a | 6.7642 ± 0.0005 Å |
b | 7.7232 ± 0.0007 Å |
c | 17.7949 ± 0.0015 Å |
α | 91.562 ± 0.007° |
β | 93.79 ± 0.006° |
γ | 113.327 ± 0.006° |
Cell volume | 850.32 ± 0.13 Å3 |
Cell temperature | 298 ± 2 K |
Ambient diffraction temperature | 298 ± 2 K |
Number of distinct elements | 6 |
Space group number | 2 |
Hermann-Mauguin space group symbol | P -1 |
Hall space group symbol | -P 1 |
Residual factor for all reflections | 0.0989 |
Residual factor for significantly intense reflections | 0.0901 |
Weighted residual factors for significantly intense reflections | 0.1815 |
Weighted residual factors for all reflections included in the refinement | 0.1918 |
Goodness-of-fit parameter for all reflections included in the refinement | 1.056 |
Diffraction radiation wavelength | 0.71073 Å |
Diffraction radiation type | MoKα |