Information card for entry 7033885
Formula | C26 H50 Cl2 Co Ir N O10 P3 Re |
Calculated formula | C26 H50 Cl2 Co Ir N O10 P3 Re |
Title of publication | Heterobimetallic rhenium nitrido complexes containing the Kläui tripodal ligand [Co(η(5)-C5H5){P(O)(OEt)2}3](.). |
Authors of publication | So, Yat-Ming; Chiu, Wai-Hang; Cheung, Wai-Man; Ng, Ho-Yuen; Lee, Hung Kay; Sung, Herman H.-Y.; Williams, Ian D.; Leung, Wa-Hung |
Journal of publication | Dalton transactions (Cambridge, England : 2003) |
Year of publication | 2015 |
Journal volume | 44 |
Journal issue | 12 |
Pages of publication | 5479 - 5487 |
a | 14.7743 ± 0.001 Å |
b | 13.7892 ± 0.001 Å |
c | 18.2139 ± 0.001 Å |
α | 90° |
β | 90.506 ± 0.01° |
γ | 90° |
Cell volume | 3710.5 ± 0.4 Å3 |
Cell temperature | 173 ± 0.14 K |
Ambient diffraction temperature | 173 ± 0.14 K |
Number of distinct elements | 9 |
Space group number | 14 |
Hermann-Mauguin space group symbol | P 1 21/c 1 |
Hall space group symbol | -P 2ybc |
Residual factor for all reflections | 0.0383 |
Residual factor for significantly intense reflections | 0.037 |
Weighted residual factors for significantly intense reflections | 0.0965 |
Weighted residual factors for all reflections included in the refinement | 0.0978 |
Goodness-of-fit parameter for all reflections included in the refinement | 1.026 |
Diffraction radiation probe | x-ray |
Diffraction radiation wavelength | 1.5418 Å |
Diffraction radiation type | CuKα |