Information card for entry 7033886
Formula | C44 H64 Cl4 Co F6 Ir N O9 P5 Re |
Calculated formula | C44 H62 Cl4 Co F6 Ir N O9 P5 Re |
Title of publication | Heterobimetallic rhenium nitrido complexes containing the Kläui tripodal ligand [Co(η(5)-C5H5){P(O)(OEt)2}3](.). |
Authors of publication | So, Yat-Ming; Chiu, Wai-Hang; Cheung, Wai-Man; Ng, Ho-Yuen; Lee, Hung Kay; Sung, Herman H.-Y.; Williams, Ian D.; Leung, Wa-Hung |
Journal of publication | Dalton transactions (Cambridge, England : 2003) |
Year of publication | 2015 |
Journal volume | 44 |
Journal issue | 12 |
Pages of publication | 5479 - 5487 |
a | 16.2567 ± 0.0002 Å |
b | 15.5814 ± 0.0002 Å |
c | 22.6734 ± 0.0003 Å |
α | 90° |
β | 90° |
γ | 90° |
Cell volume | 5743.22 ± 0.13 Å3 |
Cell temperature | 173 ± 0.14 K |
Ambient diffraction temperature | 173 ± 0.14 K |
Number of distinct elements | 10 |
Space group number | 33 |
Hermann-Mauguin space group symbol | P n a 21 |
Hall space group symbol | P 2c -2n |
Residual factor for all reflections | 0.0301 |
Residual factor for significantly intense reflections | 0.0279 |
Weighted residual factors for significantly intense reflections | 0.0572 |
Weighted residual factors for all reflections included in the refinement | 0.0581 |
Goodness-of-fit parameter for all reflections included in the refinement | 1.014 |
Diffraction radiation probe | x-ray |
Diffraction radiation wavelength | 0.7107 Å |
Diffraction radiation type | MoKα |