Information card for entry 7033890
Formula | C29 H55 Cl3 Co Ir N O10 P3 Ru |
Calculated formula | C29 H55 Cl3 Co Ir N O10 P3 Ru |
Title of publication | Heterobimetallic rhenium nitrido complexes containing the Kläui tripodal ligand [Co(η(5)-C5H5){P(O)(OEt)2}3](.). |
Authors of publication | So, Yat-Ming; Chiu, Wai-Hang; Cheung, Wai-Man; Ng, Ho-Yuen; Lee, Hung Kay; Sung, Herman H.-Y.; Williams, Ian D.; Leung, Wa-Hung |
Journal of publication | Dalton transactions (Cambridge, England : 2003) |
Year of publication | 2015 |
Journal volume | 44 |
Journal issue | 12 |
Pages of publication | 5479 - 5487 |
a | 9.2573 ± 0.0017 Å |
b | 12.638 ± 0.002 Å |
c | 17.985 ± 0.003 Å |
α | 85.953 ± 0.002° |
β | 75.562 ± 0.002° |
γ | 75.848 ± 0.002° |
Cell volume | 1975.7 ± 0.6 Å3 |
Cell temperature | 100 K |
Ambient diffraction temperature | 100 K |
Number of distinct elements | 9 |
Space group number | 2 |
Hermann-Mauguin space group symbol | P -1 |
Hall space group symbol | -P 1 |
Residual factor for all reflections | 0.0764 |
Residual factor for significantly intense reflections | 0.0583 |
Weighted residual factors for significantly intense reflections | 0.1095 |
Weighted residual factors for all reflections included in the refinement | 0.1154 |
Goodness-of-fit parameter for all reflections included in the refinement | 1.016 |
Diffraction radiation wavelength | 0.71073 Å |
Diffraction radiation type | MoKα |