Information card for entry 7033891
Common name | [Cu(HTyrbenz)2].CH3OH.H2O |
Formula | C33 H38 Cu N2 O8 |
Calculated formula | C33 H38 Cu N2 O8 |
Title of publication | Controlling the self-assembly of homochiral coordination architectures of Cu(II) by substitution in amino acid based ligands: synthesis, crystal structures and physicochemical properties. |
Authors of publication | Kumar, Navnita; Khullar, Sadhika; Mandal, Sanjay K. |
Journal of publication | Dalton transactions (Cambridge, England : 2003) |
Year of publication | 2015 |
Journal volume | 44 |
Journal issue | 12 |
Pages of publication | 5672 - 5687 |
a | 12.7195 ± 0.0019 Å |
b | 9.7533 ± 0.0014 Å |
c | 14.17 ± 0.002 Å |
α | 90° |
β | 115.087 ± 0.009° |
γ | 90° |
Cell volume | 1592.1 ± 0.4 Å3 |
Cell temperature | 260 ± 2 K |
Ambient diffraction temperature | 260 ± 2 K |
Number of distinct elements | 5 |
Space group number | 4 |
Hermann-Mauguin space group symbol | P 1 21 1 |
Hall space group symbol | P 2yb |
Residual factor for all reflections | 0.0507 |
Residual factor for significantly intense reflections | 0.0378 |
Weighted residual factors for significantly intense reflections | 0.0762 |
Weighted residual factors for all reflections included in the refinement | 0.0831 |
Goodness-of-fit parameter for all reflections included in the refinement | 0.936 |
Diffraction radiation wavelength | 0.71073 Å |
Diffraction radiation type | MoKα |