Information card for entry 7033892
Common name | [Cu(HSerbenz)2].3(H2O) |
Formula | C20 H30 Cu N2 O9 |
Calculated formula | C20 H30 Cu N2 O9 |
Title of publication | Controlling the self-assembly of homochiral coordination architectures of Cu(II) by substitution in amino acid based ligands: synthesis, crystal structures and physicochemical properties. |
Authors of publication | Kumar, Navnita; Khullar, Sadhika; Mandal, Sanjay K. |
Journal of publication | Dalton transactions (Cambridge, England : 2003) |
Year of publication | 2015 |
Journal volume | 44 |
Journal issue | 12 |
Pages of publication | 5672 - 5687 |
a | 9.2543 ± 0.0006 Å |
b | 10.038 ± 0.0008 Å |
c | 23.8749 ± 0.0019 Å |
α | 90° |
β | 90° |
γ | 90° |
Cell volume | 2217.9 ± 0.3 Å3 |
Cell temperature | 296 ± 2 K |
Ambient diffraction temperature | 296 ± 2 K |
Number of distinct elements | 5 |
Space group number | 19 |
Hermann-Mauguin space group symbol | P 21 21 21 |
Hall space group symbol | P 2ac 2ab |
Residual factor for all reflections | 0.048 |
Residual factor for significantly intense reflections | 0.0341 |
Weighted residual factors for significantly intense reflections | 0.0616 |
Weighted residual factors for all reflections included in the refinement | 0.0675 |
Goodness-of-fit parameter for all reflections included in the refinement | 0.916 |
Diffraction radiation wavelength | 0.71073 Å |
Diffraction radiation type | MoKα |