Information card for entry 7033954
Formula | C54 H83 N2 O2 Si Y |
Calculated formula | C54 H83 N2 O2 Si Y |
Title of publication | Metallacyclic yttrium alkyl and hydrido complexes: synthesis, structures and catalytic activity in intermolecular olefin hydrophosphination and hydroamination. |
Authors of publication | Kissel, Alexander A.; Mahrova, Tatyana V.; Lyubov, Dmitry M.; Cherkasov, Anton V.; Fukin, Georgy K.; Trifonov, Alexander A.; Del Rosal, Iker; Maron, Laurent |
Journal of publication | Dalton transactions (Cambridge, England : 2003) |
Year of publication | 2015 |
Journal volume | 44 |
Journal issue | 27 |
Pages of publication | 12137 - 12148 |
a | 9.9646 ± 0.001 Å |
b | 19.4922 ± 0.0019 Å |
c | 26.587 ± 0.003 Å |
α | 90° |
β | 90° |
γ | 90° |
Cell volume | 5164 ± 0.9 Å3 |
Cell temperature | 100 ± 2 K |
Ambient diffraction temperature | 100 ± 2 K |
Number of distinct elements | 6 |
Space group number | 19 |
Hermann-Mauguin space group symbol | P 21 21 21 |
Hall space group symbol | P 2ac 2ab |
Residual factor for all reflections | 0.0369 |
Residual factor for significantly intense reflections | 0.0341 |
Weighted residual factors for significantly intense reflections | 0.0811 |
Weighted residual factors for all reflections included in the refinement | 0.0822 |
Goodness-of-fit parameter for all reflections included in the refinement | 1.038 |
Diffraction radiation wavelength | 0.71073 Å |
Diffraction radiation type | MoKα |