Information card for entry 7033955
Formula | C52 H94 Li N2 O4 Si2 Y |
Calculated formula | C52 H94 Li N2 O4 Si2 Y |
Title of publication | Metallacyclic yttrium alkyl and hydrido complexes: synthesis, structures and catalytic activity in intermolecular olefin hydrophosphination and hydroamination. |
Authors of publication | Kissel, Alexander A.; Mahrova, Tatyana V.; Lyubov, Dmitry M.; Cherkasov, Anton V.; Fukin, Georgy K.; Trifonov, Alexander A.; Del Rosal, Iker; Maron, Laurent |
Journal of publication | Dalton transactions (Cambridge, England : 2003) |
Year of publication | 2015 |
Journal volume | 44 |
Journal issue | 27 |
Pages of publication | 12137 - 12148 |
a | 12.6489 ± 0.0007 Å |
b | 20.3519 ± 0.0011 Å |
c | 24.5922 ± 0.0014 Å |
α | 68.123 ± 0.001° |
β | 81.393 ± 0.001° |
γ | 76.144 ± 0.001° |
Cell volume | 5691.1 ± 0.5 Å3 |
Cell temperature | 100 ± 2 K |
Ambient diffraction temperature | 100 ± 2 K |
Number of distinct elements | 7 |
Space group number | 2 |
Hermann-Mauguin space group symbol | P -1 |
Hall space group symbol | -P 1 |
Residual factor for all reflections | 0.1401 |
Residual factor for significantly intense reflections | 0.0536 |
Weighted residual factors for significantly intense reflections | 0.0833 |
Weighted residual factors for all reflections included in the refinement | 0.0961 |
Goodness-of-fit parameter for all reflections included in the refinement | 0.831 |
Diffraction radiation wavelength | 0.71073 Å |
Diffraction radiation type | MoKα |