Information card for entry 7033967
Formula | C26 H24 Au2 P2 S2 |
Calculated formula | C26 H24 Au2 P2 S2 |
Title of publication | Syntheses and structures of two gold(i) coordination compounds derived from P-S hybrid ligands and their efficient catalytic performance in the photodegradation of nitroaromatics in water. |
Authors of publication | Qi, Hai-Xiao; Wang, Jian-Feng; Ren, Zhi-Gang; Ning, Jin-Jiao; Lang, Jian-Ping |
Journal of publication | Dalton transactions (Cambridge, England : 2003) |
Year of publication | 2015 |
Journal volume | 44 |
Journal issue | 12 |
Pages of publication | 5662 - 5671 |
a | 11.56 ± 0.002 Å |
b | 11.159 ± 0.002 Å |
c | 19.727 ± 0.004 Å |
α | 90° |
β | 98.65 ± 0.03° |
γ | 90° |
Cell volume | 2515.8 ± 0.8 Å3 |
Cell temperature | 223 ± 2 K |
Ambient diffraction temperature | 223 ± 2 K |
Number of distinct elements | 5 |
Space group number | 14 |
Hermann-Mauguin space group symbol | P 1 21/c 1 |
Hall space group symbol | -P 2ybc |
Residual factor for all reflections | 0.0582 |
Residual factor for significantly intense reflections | 0.0422 |
Weighted residual factors for significantly intense reflections | 0.0796 |
Weighted residual factors for all reflections included in the refinement | 0.0837 |
Goodness-of-fit parameter for all reflections included in the refinement | 1.101 |
Diffraction radiation wavelength | 0.71073 Å |
Diffraction radiation type | MoKα |