Information card for entry 7033968
Formula | C12 H9 Br2 F Hg N2 |
Calculated formula | C12 H9 Br2 F Hg N2 |
Title of publication | The role of weak hydrogen and halogen bonding interactions in the assembly of a series of Hg(ii) coordination polymers. |
Authors of publication | Azhdari Tehrani, Alireza; Morsali, Ali; Kubicki, Maciej |
Journal of publication | Dalton transactions (Cambridge, England : 2003) |
Year of publication | 2015 |
Journal volume | 44 |
Journal issue | 12 |
Pages of publication | 5703 - 5712 |
a | 3.9779 ± 0.0002 Å |
b | 18.8497 ± 0.0007 Å |
c | 19.0199 ± 0.0008 Å |
α | 104.225 ± 0.003° |
β | 91.415 ± 0.003° |
γ | 94.296 ± 0.003° |
Cell volume | 1377.17 ± 0.11 Å3 |
Cell temperature | 100 ± 1 K |
Ambient diffraction temperature | 100 ± 1 K |
Number of distinct elements | 6 |
Space group number | 2 |
Hermann-Mauguin space group symbol | P -1 |
Hall space group symbol | -P 1 |
Residual factor for all reflections | 0.0862 |
Residual factor for significantly intense reflections | 0.075 |
Weighted residual factors for significantly intense reflections | 0.2198 |
Weighted residual factors for all reflections included in the refinement | 0.2258 |
Goodness-of-fit parameter for all reflections included in the refinement | 1.26 |
Diffraction radiation wavelength | 0.7107 Å |
Diffraction radiation type | MoKα |