Information card for entry 7033969
Formula | C12 H9 Br2 Cl Hg N2 |
Calculated formula | C12 H9 Br2 Cl Hg N2 |
Title of publication | The role of weak hydrogen and halogen bonding interactions in the assembly of a series of Hg(ii) coordination polymers. |
Authors of publication | Azhdari Tehrani, Alireza; Morsali, Ali; Kubicki, Maciej |
Journal of publication | Dalton transactions (Cambridge, England : 2003) |
Year of publication | 2015 |
Journal volume | 44 |
Journal issue | 12 |
Pages of publication | 5703 - 5712 |
a | 4.712 ± 0.0002 Å |
b | 16.4085 ± 0.0007 Å |
c | 17.6773 ± 0.0008 Å |
α | 90° |
β | 90° |
γ | 90° |
Cell volume | 1366.75 ± 0.1 Å3 |
Cell temperature | 100 ± 1 K |
Ambient diffraction temperature | 100 ± 1 K |
Number of distinct elements | 6 |
Space group number | 19 |
Hermann-Mauguin space group symbol | P 21 21 21 |
Hall space group symbol | P 2ac 2ab |
Residual factor for all reflections | 0.0238 |
Residual factor for significantly intense reflections | 0.0221 |
Weighted residual factors for significantly intense reflections | 0.0473 |
Weighted residual factors for all reflections included in the refinement | 0.0484 |
Goodness-of-fit parameter for all reflections included in the refinement | 1.034 |
Diffraction radiation wavelength | 0.7107 Å |
Diffraction radiation type | MoKα |