Information card for entry 7033976
Formula | C14 H8 Cu4 N6 O10 |
Calculated formula | C14 H8 Cu4 N6 O10 |
Title of publication | Triazolate-based 3D frameworks and a 2D layer with centrosymmetric Cu(II)7, Cu(II)5, Cu(II)4 clusters and tunable interlayer/interchain compactness: hydrothermal syntheses, crystal structures and magnetic properties. |
Authors of publication | Zhang, Yuan-Yuan; Zhao, Hong; Yang, En-Cui; Liu, Zhong-Yi; Shang, Qiu; Zhao, Xiao-Jun |
Journal of publication | Dalton transactions (Cambridge, England : 2003) |
Year of publication | 2015 |
Journal volume | 44 |
Journal issue | 12 |
Pages of publication | 5826 - 5836 |
a | 7.843 ± 0.002 Å |
b | 9.986 ± 0.002 Å |
c | 12.32 ± 0.003 Å |
α | 67.609 ± 0.004° |
β | 78.65 ± 0.003° |
γ | 68.577 ± 0.004° |
Cell volume | 828.7 ± 0.3 Å3 |
Cell temperature | 173 ± 2 K |
Ambient diffraction temperature | 173 ± 2 K |
Number of distinct elements | 5 |
Space group number | 2 |
Hermann-Mauguin space group symbol | P -1 |
Hall space group symbol | -P 1 |
Residual factor for all reflections | 0.0523 |
Residual factor for significantly intense reflections | 0.0422 |
Weighted residual factors for significantly intense reflections | 0.1055 |
Weighted residual factors for all reflections included in the refinement | 0.1126 |
Goodness-of-fit parameter for all reflections included in the refinement | 1.043 |
Diffraction radiation wavelength | 0.71073 Å |
Diffraction radiation type | MoKα |