Information card for entry 7033977
Formula | C24 H27 Cu6 N24 O8.5 |
Calculated formula | C24 H22 Cu6 N24 O8.5 |
Title of publication | Triazolate-based 3D frameworks and a 2D layer with centrosymmetric Cu(II)7, Cu(II)5, Cu(II)4 clusters and tunable interlayer/interchain compactness: hydrothermal syntheses, crystal structures and magnetic properties. |
Authors of publication | Zhang, Yuan-Yuan; Zhao, Hong; Yang, En-Cui; Liu, Zhong-Yi; Shang, Qiu; Zhao, Xiao-Jun |
Journal of publication | Dalton transactions (Cambridge, England : 2003) |
Year of publication | 2015 |
Journal volume | 44 |
Journal issue | 12 |
Pages of publication | 5826 - 5836 |
a | 8.6725 ± 0.0009 Å |
b | 8.8145 ± 0.0009 Å |
c | 13.398 ± 0.0013 Å |
α | 78.991 ± 0.002° |
β | 73.52 ± 0.002° |
γ | 82.909 ± 0.002° |
Cell volume | 961.43 ± 0.17 Å3 |
Cell temperature | 296 ± 2 K |
Ambient diffraction temperature | 296 ± 2 K |
Number of distinct elements | 5 |
Space group number | 2 |
Hermann-Mauguin space group symbol | P -1 |
Hall space group symbol | -P 1 |
Residual factor for all reflections | 0.0629 |
Residual factor for significantly intense reflections | 0.045 |
Weighted residual factors for significantly intense reflections | 0.0921 |
Weighted residual factors for all reflections included in the refinement | 0.1021 |
Goodness-of-fit parameter for all reflections included in the refinement | 1.043 |
Diffraction radiation wavelength | 0.71073 Å |
Diffraction radiation type | MoKα |