Information card for entry 7033997
Formula | C54 H56 Cu4 N6 O11 |
Calculated formula | C54 H56 Cu4 N6 O11 |
Title of publication | Two types of nitrito support for μ4-oxido-bridged [Cu4] complexes: synthesis, crystal structures, magnetic properties and DFT analysis. |
Authors of publication | Pait, Moumita; Shatruk, Michael; Lengyel, Jeff; Gómez-Coca, Silvia; Bauzá, Antonio; Frontera, Antonio; Bertolasi, Valerio; Ray, Debashis |
Journal of publication | Dalton transactions (Cambridge, England : 2003) |
Year of publication | 2015 |
Journal volume | 44 |
Journal issue | 13 |
Pages of publication | 6107 - 6117 |
a | 14.7994 ± 0.0006 Å |
b | 14.7994 ± 0.0006 Å |
c | 23.9708 ± 0.0014 Å |
α | 90° |
β | 90° |
γ | 90° |
Cell volume | 5250.1 ± 0.4 Å3 |
Cell temperature | 100 ± 2 K |
Ambient diffraction temperature | 100 ± 2 K |
Number of distinct elements | 5 |
Space group number | 96 |
Hermann-Mauguin space group symbol | P 43 21 2 |
Hall space group symbol | P 4nw 2abw |
Residual factor for all reflections | 0.0466 |
Residual factor for significantly intense reflections | 0.036 |
Weighted residual factors for significantly intense reflections | 0.0859 |
Weighted residual factors for all reflections included in the refinement | 0.0902 |
Goodness-of-fit parameter for all reflections included in the refinement | 1.065 |
Diffraction radiation wavelength | 0.71073 Å |
Diffraction radiation type | MoKα |