Information card for entry 7033998
Formula | C24.12 H33.25 Cl4.25 N9 Pt2 |
Calculated formula | C24.125 H33.25 Cl4.25 N9 Pt2 |
Title of publication | Coupling of platinated triguanides with platinum-activated nitriles as a novel strategy for generation of dimetallic systems. |
Authors of publication | Serebryanskaya, Tatiyana V.; Novikov, Alexander S.; Gushchin, Pavel V.; Zolotarev, Andrey A.; Gurzhiy, Vladislav V.; Kukushkin, Vadim Yu |
Journal of publication | Dalton transactions (Cambridge, England : 2003) |
Year of publication | 2015 |
Journal volume | 44 |
Journal issue | 13 |
Pages of publication | 6003 - 6011 |
a | 32.9496 ± 0.0014 Å |
b | 15.7777 ± 0.0005 Å |
c | 17.6434 ± 0.0006 Å |
α | 90° |
β | 116.753 ± 0.004° |
γ | 90° |
Cell volume | 8190.4 ± 0.6 Å3 |
Cell temperature | 100 ± 2 K |
Ambient diffraction temperature | 100 ± 2 K |
Number of distinct elements | 5 |
Space group number | 15 |
Hermann-Mauguin space group symbol | C 1 2/c 1 |
Hall space group symbol | -C 2yc |
Residual factor for all reflections | 0.1244 |
Residual factor for significantly intense reflections | 0.0713 |
Weighted residual factors for significantly intense reflections | 0.1703 |
Weighted residual factors for all reflections included in the refinement | 0.1978 |
Goodness-of-fit parameter for all reflections included in the refinement | 1.056 |
Diffraction radiation wavelength | 0.71073 Å |
Diffraction radiation type | MoKα |