Information card for entry 7034006
Formula | C26 H33 Cu7 N10 O26.5 S2 |
Calculated formula | C26 H28 Cu7 N10 O26.5 S2 |
Title of publication | A (3,6)-connected layer with an unprecedented adeninate nucleobase-derived heptanuclear disc. |
Authors of publication | Liu, Zheng-Yu; Zhang, Hong-Yun; Yang, En-Cui; Liu, Zhong-Yi; Zhao, Xiao-Jun |
Journal of publication | Dalton transactions (Cambridge, England : 2003) |
Year of publication | 2015 |
Journal volume | 44 |
Journal issue | 12 |
Pages of publication | 5280 - 5283 |
a | 7.7233 ± 0.0011 Å |
b | 12.3827 ± 0.0017 Å |
c | 12.4646 ± 0.0017 Å |
α | 68.448 ± 0.002° |
β | 78.217 ± 0.003° |
γ | 81.382 ± 0.003° |
Cell volume | 1081.7 ± 0.3 Å3 |
Cell temperature | 296 ± 2 K |
Ambient diffraction temperature | 296 ± 2 K |
Number of distinct elements | 6 |
Space group number | 2 |
Hermann-Mauguin space group symbol | P -1 |
Hall space group symbol | -P 1 |
Residual factor for all reflections | 0.0541 |
Residual factor for significantly intense reflections | 0.0454 |
Weighted residual factors for significantly intense reflections | 0.0924 |
Weighted residual factors for all reflections included in the refinement | 0.0959 |
Goodness-of-fit parameter for all reflections included in the refinement | 1.073 |
Diffraction radiation wavelength | 0.71073 Å |
Diffraction radiation type | MoKα |