Information card for entry 7034007
Formula | C14 H24 O12 Tb2 |
Calculated formula | C14 H24 O12 Tb2 |
Title of publication | Lanthanide hydroxide ribbons assembled in a 2D network: slow relaxation of the magnetization in the dysprosium(iii) complex. |
Authors of publication | Ma, Xiaozhou; Xu, Na; Gao, Chen; Li, Leilei; Wang, Bingwu; Shi, Wei; Cheng, Peng |
Journal of publication | Dalton transactions (Cambridge, England : 2003) |
Year of publication | 2015 |
Journal volume | 44 |
Journal issue | 12 |
Pages of publication | 5276 - 5279 |
a | 7.1577 ± 0.0005 Å |
b | 9.9319 ± 0.001 Å |
c | 14.9339 ± 0.0017 Å |
α | 71.781 ± 0.01° |
β | 82.756 ± 0.008° |
γ | 75.432 ± 0.008° |
Cell volume | 974.7 ± 0.18 Å3 |
Cell temperature | 130.6 ± 0.9 K |
Ambient diffraction temperature | 130.6 ± 0.9 K |
Number of distinct elements | 4 |
Space group number | 2 |
Hermann-Mauguin space group symbol | P -1 |
Hall space group symbol | -P 1 |
Residual factor for all reflections | 0.0321 |
Residual factor for significantly intense reflections | 0.0278 |
Weighted residual factors for significantly intense reflections | 0.0632 |
Weighted residual factors for all reflections included in the refinement | 0.0668 |
Goodness-of-fit parameter for all reflections included in the refinement | 1.029 |
Diffraction radiation wavelength | 0.71073 Å |
Diffraction radiation type | MoKα |