Information card for entry 7034008
Formula | C14 H24 Dy2 O12 |
Calculated formula | C14 H24 Dy2 O12 |
Title of publication | Lanthanide hydroxide ribbons assembled in a 2D network: slow relaxation of the magnetization in the dysprosium(iii) complex. |
Authors of publication | Ma, Xiaozhou; Xu, Na; Gao, Chen; Li, Leilei; Wang, Bingwu; Shi, Wei; Cheng, Peng |
Journal of publication | Dalton transactions (Cambridge, England : 2003) |
Year of publication | 2015 |
Journal volume | 44 |
Journal issue | 12 |
Pages of publication | 5276 - 5279 |
a | 7.1628 ± 0.0005 Å |
b | 9.9371 ± 0.0006 Å |
c | 14.9972 ± 0.001 Å |
α | 71.52 ± 0.006° |
β | 83.425 ± 0.006° |
γ | 75.425 ± 0.006° |
Cell volume | 979.14 ± 0.12 Å3 |
Cell temperature | 127.8 ± 0.2 K |
Ambient diffraction temperature | 127.8 ± 0.2 K |
Number of distinct elements | 4 |
Space group number | 2 |
Hermann-Mauguin space group symbol | P -1 |
Hall space group symbol | -P 1 |
Residual factor for all reflections | 0.0441 |
Residual factor for significantly intense reflections | 0.0392 |
Weighted residual factors for significantly intense reflections | 0.0947 |
Weighted residual factors for all reflections included in the refinement | 0.1007 |
Goodness-of-fit parameter for all reflections included in the refinement | 1.046 |
Diffraction radiation wavelength | 0.71073 Å |
Diffraction radiation type | MoKα |