Information card for entry 7034013
Common name | K4MgW3O12 |
Formula | K4 Mg O12 W3 |
Calculated formula | K4 Mg O12 W3 |
SMILES | [W](=O)(=O)([O-])[O-].[W](=O)(=O)([O-])[O-].[W](=O)(=O)([O-])[O-].[K+].[K+].[K+].[K+].[Mg+2] |
Title of publication | Effect of the cation size on the framework structures of magnesium tungstate, A4Mg(WO4)3 (A = Na, K), R2Mg2(WO4)3 (R = Rb, Cs). |
Authors of publication | Han, Shujuan; Wang, Ying; Jing, Qun; Wu, Hongping; Pan, Shilie; Yang, Zhihua |
Journal of publication | Dalton transactions (Cambridge, England : 2003) |
Year of publication | 2015 |
Journal volume | 44 |
Journal issue | 12 |
Pages of publication | 5810 - 5817 |
a | 7.7255 ± 0.0014 Å |
b | 9.9119 ± 0.0019 Å |
c | 10.0401 ± 0.0018 Å |
α | 93.249 ± 0.01° |
β | 106.624 ± 0.01° |
γ | 105.781 ± 0.011° |
Cell volume | 701.3 ± 0.2 Å3 |
Cell temperature | 293 ± 2 K |
Ambient diffraction temperature | 293 ± 2 K |
Number of distinct elements | 4 |
Space group number | 2 |
Hermann-Mauguin space group symbol | P -1 |
Hall space group symbol | -P 1 |
Residual factor for all reflections | 0.0411 |
Residual factor for significantly intense reflections | 0.0303 |
Weighted residual factors for significantly intense reflections | 0.0619 |
Weighted residual factors for all reflections included in the refinement | 0.0658 |
Goodness-of-fit parameter for all reflections included in the refinement | 1.089 |
Diffraction radiation wavelength | 0.71073 Å |
Diffraction radiation type | MoKα |