Information card for entry 7034014
Common name | Cs2Mg2O12W3 |
Formula | Cs2 Mg2 O12 W3 |
Calculated formula | Cs2 Mg2 O12 W3 |
Title of publication | Effect of the cation size on the framework structures of magnesium tungstate, A4Mg(WO4)3 (A = Na, K), R2Mg2(WO4)3 (R = Rb, Cs). |
Authors of publication | Han, Shujuan; Wang, Ying; Jing, Qun; Wu, Hongping; Pan, Shilie; Yang, Zhihua |
Journal of publication | Dalton transactions (Cambridge, England : 2003) |
Year of publication | 2015 |
Journal volume | 44 |
Journal issue | 12 |
Pages of publication | 5810 - 5817 |
a | 10.8783 ± 0.0006 Å |
b | 10.8783 ± 0.0006 Å |
c | 10.8783 ± 0.0006 Å |
α | 90° |
β | 90° |
γ | 90° |
Cell volume | 1287.31 ± 0.12 Å3 |
Cell temperature | 296 ± 2 K |
Ambient diffraction temperature | 296 ± 2 K |
Number of distinct elements | 4 |
Space group number | 198 |
Hermann-Mauguin space group symbol | P 21 3 |
Hall space group symbol | P 2ac 2ab 3 |
Residual factor for all reflections | 0.0147 |
Residual factor for significantly intense reflections | 0.0141 |
Weighted residual factors for significantly intense reflections | 0.0299 |
Weighted residual factors for all reflections included in the refinement | 0.0302 |
Goodness-of-fit parameter for all reflections included in the refinement | 0.907 |
Diffraction radiation wavelength | 0.71073 Å |
Diffraction radiation type | MoKα |