Information card for entry 7034026
Formula | C15 H20 Ag Cl N4 O4 |
Calculated formula | C15 H20 Ag Cl N4 O4 |
Title of publication | Macrocyclic dinuclear, helical, layered and 3-D Ag(i) complexes constructed from AgX (X = NO3(-) and ClO4(-)) and flexible bis(pyridyl) ligands with a chelating spacer: syntheses, structures and photoluminescence properties. |
Authors of publication | Huang, Jing; Deng, Zhao-Peng; Xiao, Ying-Hui; Huo, Li-Hua; Zhao, Shu-Nan; Ge, Fa-Yuan; Gao, Shan |
Journal of publication | Dalton transactions (Cambridge, England : 2003) |
Year of publication | 2015 |
Journal volume | 44 |
Journal issue | 12 |
Pages of publication | 5837 - 5847 |
a | 9.8204 ± 0.0005 Å |
b | 11.0676 ± 0.0004 Å |
c | 17.5147 ± 0.0004 Å |
α | 90° |
β | 93.162 ± 0.003° |
γ | 90° |
Cell volume | 1900.74 ± 0.13 Å3 |
Cell temperature | 293 ± 2 K |
Ambient diffraction temperature | 293 ± 2 K |
Number of distinct elements | 6 |
Space group number | 14 |
Hermann-Mauguin space group symbol | P 1 21/n 1 |
Hall space group symbol | -P 2yn |
Residual factor for all reflections | 0.0927 |
Residual factor for significantly intense reflections | 0.0519 |
Weighted residual factors for significantly intense reflections | 0.119 |
Weighted residual factors for all reflections included in the refinement | 0.1441 |
Goodness-of-fit parameter for all reflections included in the refinement | 1.021 |
Diffraction radiation wavelength | 0.71073 Å |
Diffraction radiation type | MoKα |