Information card for entry 7034027
Formula | C30 H64 Ag2 Cl6 N8 O33 |
Calculated formula | C30 H64 Ag2 Cl6 N8 O33 |
Title of publication | Macrocyclic dinuclear, helical, layered and 3-D Ag(i) complexes constructed from AgX (X = NO3(-) and ClO4(-)) and flexible bis(pyridyl) ligands with a chelating spacer: syntheses, structures and photoluminescence properties. |
Authors of publication | Huang, Jing; Deng, Zhao-Peng; Xiao, Ying-Hui; Huo, Li-Hua; Zhao, Shu-Nan; Ge, Fa-Yuan; Gao, Shan |
Journal of publication | Dalton transactions (Cambridge, England : 2003) |
Year of publication | 2015 |
Journal volume | 44 |
Journal issue | 12 |
Pages of publication | 5837 - 5847 |
a | 8.0338 ± 0.0005 Å |
b | 13.8229 ± 0.0008 Å |
c | 14.058 ± 0.001 Å |
α | 70.665 ± 0.006° |
β | 81.349 ± 0.006° |
γ | 73.418 ± 0.006° |
Cell volume | 1409.13 ± 0.17 Å3 |
Cell temperature | 295 ± 2 K |
Ambient diffraction temperature | 295 ± 2 K |
Number of distinct elements | 6 |
Space group number | 2 |
Hermann-Mauguin space group symbol | P -1 |
Hall space group symbol | -P 1 |
Residual factor for all reflections | 0.0799 |
Residual factor for significantly intense reflections | 0.0582 |
Weighted residual factors for significantly intense reflections | 0.1541 |
Weighted residual factors for all reflections included in the refinement | 0.1756 |
Goodness-of-fit parameter for all reflections included in the refinement | 1.031 |
Diffraction radiation wavelength | 0.71073 Å |
Diffraction radiation type | MoKα |