Information card for entry 7034029
Formula | C15 H22 Ag Cl N4 O5 |
Calculated formula | C15 H22 Ag Cl N4 O5 |
Title of publication | Macrocyclic dinuclear, helical, layered and 3-D Ag(i) complexes constructed from AgX (X = NO3(-) and ClO4(-)) and flexible bis(pyridyl) ligands with a chelating spacer: syntheses, structures and photoluminescence properties. |
Authors of publication | Huang, Jing; Deng, Zhao-Peng; Xiao, Ying-Hui; Huo, Li-Hua; Zhao, Shu-Nan; Ge, Fa-Yuan; Gao, Shan |
Journal of publication | Dalton transactions (Cambridge, England : 2003) |
Year of publication | 2015 |
Journal volume | 44 |
Journal issue | 12 |
Pages of publication | 5837 - 5847 |
a | 24.365 ± 0.0018 Å |
b | 8.6123 ± 0.0007 Å |
c | 36.092 ± 0.003 Å |
α | 90° |
β | 90° |
γ | 90° |
Cell volume | 7573.5 ± 1 Å3 |
Cell temperature | 295 ± 2 K |
Ambient diffraction temperature | 295 ± 2 K |
Number of distinct elements | 6 |
Space group number | 70 |
Hermann-Mauguin space group symbol | F d d d :2 |
Hall space group symbol | -F 2uv 2vw |
Residual factor for all reflections | 0.0788 |
Residual factor for significantly intense reflections | 0.0521 |
Weighted residual factors for significantly intense reflections | 0.1283 |
Weighted residual factors for all reflections included in the refinement | 0.1493 |
Goodness-of-fit parameter for all reflections included in the refinement | 1.02 |
Diffraction radiation wavelength | 0.71073 Å |
Diffraction radiation type | MoKα |