Information card for entry 7034043
Formula | C20 H24 Cu Mo8 N6 O26 |
Calculated formula | C20 H24 Cu Mo8 N6 O26 |
Title of publication | Two novel octamolybdate nanoclusters as catalysts for dye degradation by air under room conditions. |
Authors of publication | Najafi, Mahnaz; Abbasi, Alireza; Masteri-Farahani, Majid; Janczak, Jan |
Journal of publication | Dalton transactions (Cambridge, England : 2003) |
Year of publication | 2015 |
Journal volume | 44 |
Journal issue | 13 |
Pages of publication | 6089 - 6097 |
a | 7.7964 ± 0.0005 Å |
b | 10.4432 ± 0.0005 Å |
c | 13.0463 ± 0.001 Å |
α | 100.635 ± 0.005° |
β | 100.924 ± 0.006° |
γ | 108.981 ± 0.005° |
Cell volume | 950.96 ± 0.12 Å3 |
Cell temperature | 295 ± 2 K |
Ambient diffraction temperature | 295 ± 2 K |
Number of distinct elements | 6 |
Space group number | 2 |
Hermann-Mauguin space group symbol | P -1 |
Hall space group symbol | -P 1 |
Residual factor for all reflections | 0.0593 |
Residual factor for significantly intense reflections | 0.035 |
Weighted residual factors for significantly intense reflections | 0.0675 |
Weighted residual factors for all reflections included in the refinement | 0.0784 |
Goodness-of-fit parameter for all reflections included in the refinement | 1.001 |
Diffraction radiation wavelength | 0.71073 Å |
Diffraction radiation type | MoKα |