Information card for entry 7034044
Formula | C30 H30 Mo8 N6 O28 |
Calculated formula | C30 H28 Mo8 N6 O28 |
Title of publication | Two novel octamolybdate nanoclusters as catalysts for dye degradation by air under room conditions. |
Authors of publication | Najafi, Mahnaz; Abbasi, Alireza; Masteri-Farahani, Majid; Janczak, Jan |
Journal of publication | Dalton transactions (Cambridge, England : 2003) |
Year of publication | 2015 |
Journal volume | 44 |
Journal issue | 13 |
Pages of publication | 6089 - 6097 |
a | 18.8599 ± 0.0008 Å |
b | 19.0464 ± 0.0007 Å |
c | 10.2919 ± 0.0004 Å |
α | 90° |
β | 104.635 ± 0.004° |
γ | 90° |
Cell volume | 3577 ± 0.3 Å3 |
Cell temperature | 295 ± 2 K |
Ambient diffraction temperature | 295 ± 2 K |
Number of distinct elements | 5 |
Space group number | 12 |
Hermann-Mauguin space group symbol | C 1 2/m 1 |
Hall space group symbol | -C 2y |
Residual factor for all reflections | 0.0658 |
Residual factor for significantly intense reflections | 0.0334 |
Weighted residual factors for significantly intense reflections | 0.066 |
Weighted residual factors for all reflections included in the refinement | 0.0788 |
Goodness-of-fit parameter for all reflections included in the refinement | 1.003 |
Diffraction radiation wavelength | 0.71073 Å |
Diffraction radiation type | MoKα |