Information card for entry 7034045
Formula | C24 H33 Al N2 |
Calculated formula | C24 H33 Al N2 |
Title of publication | Synthesis, structural studies and ligand influence on the stability of aryl-NHC stabilised trimethylaluminium complexes. |
Authors of publication | Wu M, Melissa; Gill, Arran M.; Yunpeng, Lu; Falivene, Laura; Yongxin, Li; Ganguly, Rakesh; Cavallo, Luigi; García, Felipe |
Journal of publication | Dalton transactions (Cambridge, England : 2003) |
Year of publication | 2015 |
Journal volume | 44 |
Journal issue | 34 |
Pages of publication | 15166 - 15174 |
a | 22.9414 ± 0.0009 Å |
b | 12.2109 ± 0.0005 Å |
c | 8.0965 ± 0.0003 Å |
α | 90° |
β | 90° |
γ | 90° |
Cell volume | 2268.11 ± 0.15 Å3 |
Cell temperature | 103 ± 2 K |
Ambient diffraction temperature | 103 ± 2 K |
Number of distinct elements | 4 |
Space group number | 62 |
Hermann-Mauguin space group symbol | P n m a |
Hall space group symbol | -P 2ac 2n |
Residual factor for all reflections | 0.1098 |
Residual factor for significantly intense reflections | 0.0552 |
Weighted residual factors for significantly intense reflections | 0.1339 |
Weighted residual factors for all reflections included in the refinement | 0.1608 |
Goodness-of-fit parameter for all reflections included in the refinement | 0.971 |
Diffraction radiation wavelength | 0.71073 Å |
Diffraction radiation type | MoKα |