Information card for entry 7034053
Formula | C46 H186 Cl18 Cu24 N18 O170 Sm6 |
Calculated formula | C46 H110 Cl18 Cu24 N18 O170 Sm6 |
Title of publication | Syntheses, structures, and properties of a series of novel high-nuclear 3d-4f clusters with mixed amino acids as ligands: {Ln6Cu24}(Ln = Gd, Tb, Pr and Sm). |
Authors of publication | Shen, Chao-Jun; Hu, Sheng-Min; Sheng, Tian-Lu; Xue, Zhen-Zhen; Wu, Xin-Tao |
Journal of publication | Dalton transactions (Cambridge, England : 2003) |
Year of publication | 2015 |
Journal volume | 44 |
Journal issue | 14 |
Pages of publication | 6510 - 6515 |
a | 18.802 ± 0.003 Å |
b | 19.104 ± 0.003 Å |
c | 19.128 ± 0.004 Å |
α | 118.688 ± 0.004° |
β | 102.919 ± 0.009° |
γ | 95.555 ± 0.007° |
Cell volume | 5704.8 ± 1.8 Å3 |
Cell temperature | 293 ± 2 K |
Ambient diffraction temperature | 293 ± 2 K |
Number of distinct elements | 7 |
Space group number | 2 |
Hermann-Mauguin space group symbol | P -1 |
Hall space group symbol | -P 1 |
Residual factor for all reflections | 0.0828 |
Residual factor for significantly intense reflections | 0.0749 |
Weighted residual factors for significantly intense reflections | 0.2107 |
Weighted residual factors for all reflections included in the refinement | 0.2187 |
Goodness-of-fit parameter for all reflections included in the refinement | 1.029 |
Diffraction radiation wavelength | 0.71073 Å |
Diffraction radiation type | MoKα |