Information card for entry 7034054
Formula | C42 H178 Cl18 Cu24 N18 O170 Tb6 |
Calculated formula | C42 H114 Cl18 Cu24 N18 O170 Tb6 |
Title of publication | Syntheses, structures, and properties of a series of novel high-nuclear 3d-4f clusters with mixed amino acids as ligands: {Ln6Cu24}(Ln = Gd, Tb, Pr and Sm). |
Authors of publication | Shen, Chao-Jun; Hu, Sheng-Min; Sheng, Tian-Lu; Xue, Zhen-Zhen; Wu, Xin-Tao |
Journal of publication | Dalton transactions (Cambridge, England : 2003) |
Year of publication | 2015 |
Journal volume | 44 |
Journal issue | 14 |
Pages of publication | 6510 - 6515 |
a | 18.701 Å |
b | 18.9559 ± 0.0001 Å |
c | 18.9616 ± 0.0003 Å |
α | 118.643 ± 0.003° |
β | 103.281 ± 0.008° |
γ | 95.222 ± 0.006° |
Cell volume | 5580 ± 0.4 Å3 |
Cell temperature | 293 ± 2 K |
Ambient diffraction temperature | 293 ± 2 K |
Number of distinct elements | 7 |
Space group number | 2 |
Hermann-Mauguin space group symbol | P -1 |
Hall space group symbol | -P 1 |
Residual factor for all reflections | 0.0677 |
Residual factor for significantly intense reflections | 0.0628 |
Weighted residual factors for significantly intense reflections | 0.1953 |
Weighted residual factors for all reflections included in the refinement | 0.202 |
Goodness-of-fit parameter for all reflections included in the refinement | 1.05 |
Diffraction radiation wavelength | 0.71073 Å |
Diffraction radiation type | MoKα |