Information card for entry 7034057
Formula | C45 H41 F18 N4 O14 Tb |
Calculated formula | C45 H41 F18 N4 O14 Tb |
Title of publication | Three new mononuclear tri-spin lanthanide-nitronyl nitroxide radical compounds: syntheses, structures and magnetic properties. |
Authors of publication | Li, Lei-Lei; Liu, Shuang; Zhang, Yuan; Shi, Wei; Cheng, Peng |
Journal of publication | Dalton transactions (Cambridge, England : 2003) |
Year of publication | 2015 |
Journal volume | 44 |
Journal issue | 13 |
Pages of publication | 6118 - 6125 |
a | 12.9249 ± 0.0004 Å |
b | 16.959 ± 0.0004 Å |
c | 26.6066 ± 0.001 Å |
α | 90° |
β | 110.593 ± 0.003° |
γ | 90° |
Cell volume | 5459.3 ± 0.3 Å3 |
Cell temperature | 293 ± 2 K |
Ambient diffraction temperature | 293 ± 2 K |
Number of distinct elements | 6 |
Space group number | 14 |
Hermann-Mauguin space group symbol | P 1 21/c 1 |
Hall space group symbol | -P 2ybc |
Residual factor for all reflections | 0.0565 |
Residual factor for significantly intense reflections | 0.0396 |
Weighted residual factors for significantly intense reflections | 0.0678 |
Weighted residual factors for all reflections included in the refinement | 0.0764 |
Goodness-of-fit parameter for all reflections included in the refinement | 1.034 |
Diffraction radiation wavelength | 0.71073 Å |
Diffraction radiation type | MoKα |