Information card for entry 7034058
Formula | C45 H41 Dy F18 N4 O14 |
Calculated formula | C45 H41 Dy F18 N4 O14 |
SMILES | C1=C(C(F)(F)F)O[Dy]23(ON4C(=N(=O)C(C)(C)C4(C)C)c4ccc(cc4)C(=O)OC)(OC(=CC(=[O]3)C(F)(F)F)C(F)(F)F)(ON3C(=N(=O)C(C)(C)C3(C)C)c3ccc(cc3)C(=O)OC)([O]=C1C(F)(F)F)OC(=CC(=[O]2)C(F)(F)F)C(F)(F)F |
Title of publication | Three new mononuclear tri-spin lanthanide-nitronyl nitroxide radical compounds: syntheses, structures and magnetic properties. |
Authors of publication | Li, Lei-Lei; Liu, Shuang; Zhang, Yuan; Shi, Wei; Cheng, Peng |
Journal of publication | Dalton transactions (Cambridge, England : 2003) |
Year of publication | 2015 |
Journal volume | 44 |
Journal issue | 13 |
Pages of publication | 6118 - 6125 |
a | 23.9453 ± 0.001 Å |
b | 10.4449 ± 0.0006 Å |
c | 21.5316 ± 0.0008 Å |
α | 90° |
β | 92.426 ± 0.003° |
γ | 90° |
Cell volume | 5380.4 ± 0.4 Å3 |
Cell temperature | 293 ± 2 K |
Ambient diffraction temperature | 293 ± 2 K |
Number of distinct elements | 6 |
Space group number | 15 |
Hermann-Mauguin space group symbol | C 1 2/c 1 |
Hall space group symbol | -C 2yc |
Residual factor for all reflections | 0.0434 |
Residual factor for significantly intense reflections | 0.0382 |
Weighted residual factors for significantly intense reflections | 0.0786 |
Weighted residual factors for all reflections included in the refinement | 0.0825 |
Goodness-of-fit parameter for all reflections included in the refinement | 1.029 |
Diffraction radiation wavelength | 0.71073 Å |
Diffraction radiation type | MoKα |