Information card for entry 7034116
Formula | C31.5 H40.5 N2 O3 Pd |
Calculated formula | C27 H30 N2 O3 Pd |
SMILES | [Pd]12([n]3c(C(=[N]2c2c(cccc2C(C)C)C(C)C)C)cccc3c2c(O1)cccc2)OC(=O)C |
Title of publication | O,N,N-Pincer ligand effects on oxidatively induced carbon-chlorine coupling reactions at palladium. |
Authors of publication | Wright, Luka A.; Hope, Eric G.; Solan, Gregory A.; Cross, Warren B.; Singh, Kuldip |
Journal of publication | Dalton transactions (Cambridge, England : 2003) |
Year of publication | 2015 |
Journal volume | 44 |
Journal issue | 13 |
Pages of publication | 6040 - 6051 |
a | 26.91 ± 0.008 Å |
b | 14.159 ± 0.004 Å |
c | 15.463 ± 0.005 Å |
α | 90° |
β | 110.788 ± 0.006° |
γ | 90° |
Cell volume | 5508 ± 3 Å3 |
Cell temperature | 150 ± 2 K |
Ambient diffraction temperature | 150 ± 2 K |
Number of distinct elements | 5 |
Space group number | 15 |
Hermann-Mauguin space group symbol | C 1 2/c 1 |
Hall space group symbol | -C 2yc |
Residual factor for all reflections | 0.0713 |
Residual factor for significantly intense reflections | 0.049 |
Weighted residual factors for significantly intense reflections | 0.1019 |
Weighted residual factors for all reflections included in the refinement | 0.1084 |
Goodness-of-fit parameter for all reflections included in the refinement | 0.959 |
Diffraction radiation wavelength | 0.71073 Å |
Diffraction radiation type | MoKα |