Information card for entry 7034117
Formula | C26.5 H29.5 Cl4.5 N2 O3 Pd |
Calculated formula | C25 H28 N2 O3 Pd |
SMILES | [Pd]12([n]3c(C([NH]2c2ccc(cc2)C(C)C)(C)C)cccc3c2c(O1)cccc2)OC(=O)C |
Title of publication | O,N,N-Pincer ligand effects on oxidatively induced carbon-chlorine coupling reactions at palladium. |
Authors of publication | Wright, Luka A.; Hope, Eric G.; Solan, Gregory A.; Cross, Warren B.; Singh, Kuldip |
Journal of publication | Dalton transactions (Cambridge, England : 2003) |
Year of publication | 2015 |
Journal volume | 44 |
Journal issue | 13 |
Pages of publication | 6040 - 6051 |
a | 16.155 ± 0.004 Å |
b | 13.91 ± 0.003 Å |
c | 13.36 ± 0.003 Å |
α | 90° |
β | 109.643 ± 0.005° |
γ | 90° |
Cell volume | 2827.5 ± 1.1 Å3 |
Cell temperature | 150 ± 2 K |
Ambient diffraction temperature | 150 ± 2 K |
Number of distinct elements | 6 |
Space group number | 14 |
Hermann-Mauguin space group symbol | P 1 21/c 1 |
Hall space group symbol | -P 2ybc |
Residual factor for all reflections | 0.194 |
Residual factor for significantly intense reflections | 0.0695 |
Weighted residual factors for significantly intense reflections | 0.1575 |
Weighted residual factors for all reflections included in the refinement | 0.1815 |
Goodness-of-fit parameter for all reflections included in the refinement | 0.725 |
Diffraction radiation wavelength | 0.71073 Å |
Diffraction radiation type | MoKα |