Information card for entry 7034130
Formula | C17 H21 F4 Ho N4 O10 |
Calculated formula | C17 H21 F4 Ho N4 O10 |
Title of publication | Bright luminescence in lanthanide coordination polymers with tetrafluoroterephthalate as a bridging ligand. |
Authors of publication | Sobieray, Miriam; Gode, Jens; Seidel, Christiane; Poß, Marieke; Feldmann, Claus; Ruschewitz, Uwe |
Journal of publication | Dalton transactions (Cambridge, England : 2003) |
Year of publication | 2015 |
Journal volume | 44 |
Journal issue | 13 |
Pages of publication | 6249 - 6259 |
a | 22.047 ± 0.004 Å |
b | 11.3219 ± 0.0015 Å |
c | 20.515 ± 0.006 Å |
α | 90° |
β | 111.38 ± 0.02° |
γ | 90° |
Cell volume | 4768.4 ± 1.9 Å3 |
Cell temperature | 293 ± 2 K |
Ambient diffraction temperature | 293 ± 2 K |
Number of distinct elements | 6 |
Space group number | 15 |
Hermann-Mauguin space group symbol | C 1 2/c 1 |
Hall space group symbol | -C 2yc |
Residual factor for all reflections | 0.1003 |
Residual factor for significantly intense reflections | 0.0698 |
Weighted residual factors for significantly intense reflections | 0.1689 |
Weighted residual factors for all reflections included in the refinement | 0.1798 |
Goodness-of-fit parameter for all reflections included in the refinement | 0.915 |
Diffraction radiation wavelength | 0.71073 Å |
Diffraction radiation type | MoKα |