Information card for entry 7034131
Formula | C17 H21 F4 N4 O10 Tm |
Calculated formula | C17 H21 F4 N4 O10 Tm |
Title of publication | Bright luminescence in lanthanide coordination polymers with tetrafluoroterephthalate as a bridging ligand. |
Authors of publication | Sobieray, Miriam; Gode, Jens; Seidel, Christiane; Poß, Marieke; Feldmann, Claus; Ruschewitz, Uwe |
Journal of publication | Dalton transactions (Cambridge, England : 2003) |
Year of publication | 2015 |
Journal volume | 44 |
Journal issue | 13 |
Pages of publication | 6249 - 6259 |
a | 22.007 ± 0.002 Å |
b | 11.2742 ± 0.001 Å |
c | 20.484 ± 0.002 Å |
α | 90° |
β | 111.459 ± 0.008° |
γ | 90° |
Cell volume | 4730 ± 0.8 Å3 |
Cell temperature | 293 ± 2 K |
Ambient diffraction temperature | 293 ± 2 K |
Number of distinct elements | 6 |
Space group number | 15 |
Hermann-Mauguin space group symbol | C 1 2/c 1 |
Hall space group symbol | -C 2yc |
Residual factor for all reflections | 0.0325 |
Residual factor for significantly intense reflections | 0.0289 |
Weighted residual factors for significantly intense reflections | 0.0766 |
Weighted residual factors for all reflections included in the refinement | 0.079 |
Goodness-of-fit parameter for all reflections included in the refinement | 1.037 |
Diffraction radiation wavelength | 0.71073 Å |
Diffraction radiation type | MoKα |