Information card for entry 7034151
Formula | C54 H65 Mn4 N10 O18 S7 |
Calculated formula | C54 H64.948 Mn4 N10 O18 S7 |
Title of publication | Solvent dependent reactivities of di-, tetra- and hexanuclear manganese complexes: syntheses, structures and magnetic properties. |
Authors of publication | Yang, Hua; Cao, Fan; Li, Dacheng; Zeng, Suyuan; Song, You; Dou, Jianmin |
Journal of publication | Dalton transactions (Cambridge, England : 2003) |
Year of publication | 2015 |
Journal volume | 44 |
Journal issue | 14 |
Pages of publication | 6620 - 6629 |
a | 44.504 ± 0.004 Å |
b | 14.6592 ± 0.0011 Å |
c | 24.169 ± 0.002 Å |
α | 90° |
β | 103.539 ± 0.002° |
γ | 90° |
Cell volume | 15330 ± 2 Å3 |
Cell temperature | 298 ± 2 K |
Ambient diffraction temperature | 298 ± 2 K |
Number of distinct elements | 6 |
Space group number | 15 |
Hermann-Mauguin space group symbol | C 1 2/c 1 |
Hall space group symbol | -C 2yc |
Residual factor for all reflections | 0.1787 |
Residual factor for significantly intense reflections | 0.0902 |
Weighted residual factors for significantly intense reflections | 0.2162 |
Weighted residual factors for all reflections included in the refinement | 0.24 |
Goodness-of-fit parameter for all reflections included in the refinement | 1 |
Diffraction radiation wavelength | 0.71073 Å |
Diffraction radiation type | MoKα |