Information card for entry 7034166
Formula | C58.5 H72 Cl Cu8 I6 N9 P6 |
Calculated formula | C58.5 H72 Cl Cu8 I6 N9 P6 |
Title of publication | Unexpected fragmentations of triphosphaferrocene - formation of supramolecular assemblies containing the (1,2,4-P3C2Mes2)(-) ligand. |
Authors of publication | Heindl, Claudia; Kuntz, Andrea; Peresypkina, Eugenia V.; Virovets, Alexander V.; Zabel, Manfred; Lüdeker, David; Brunklaus, Gunther; Scheer, Manfred |
Journal of publication | Dalton transactions (Cambridge, England : 2003) |
Year of publication | 2015 |
Journal volume | 44 |
Journal issue | 14 |
Pages of publication | 6502 - 6509 |
a | 48.744 ± 0.003 Å |
b | 12.3812 ± 0.0005 Å |
c | 30.1538 ± 0.0019 Å |
α | 90° |
β | 117.951 ± 0.009° |
γ | 90° |
Cell volume | 16075 ± 2 Å3 |
Cell temperature | 123 ± 2 K |
Ambient diffraction temperature | 123 ± 2 K |
Number of distinct elements | 7 |
Space group number | 15 |
Hermann-Mauguin space group symbol | C 1 2/c 1 |
Hall space group symbol | -C 2yc |
Residual factor for all reflections | 0.1159 |
Residual factor for significantly intense reflections | 0.0672 |
Weighted residual factors for significantly intense reflections | 0.1571 |
Weighted residual factors for all reflections included in the refinement | 0.1714 |
Goodness-of-fit parameter for all reflections included in the refinement | 0.79 |
Diffraction radiation wavelength | 1.54178 Å |
Diffraction radiation type | CuKα |