Information card for entry 7034167
Formula | C60.6 H75.2 Cl1.2 Cu7 Fe I6 N5 P6 |
Calculated formula | C60.6 H75.2 Cl1.2 Cu7 Fe I6 N5 P6 |
Title of publication | Unexpected fragmentations of triphosphaferrocene - formation of supramolecular assemblies containing the (1,2,4-P3C2Mes2)(-) ligand. |
Authors of publication | Heindl, Claudia; Kuntz, Andrea; Peresypkina, Eugenia V.; Virovets, Alexander V.; Zabel, Manfred; Lüdeker, David; Brunklaus, Gunther; Scheer, Manfred |
Journal of publication | Dalton transactions (Cambridge, England : 2003) |
Year of publication | 2015 |
Journal volume | 44 |
Journal issue | 14 |
Pages of publication | 6502 - 6509 |
a | 12.5667 ± 0.0006 Å |
b | 29.4452 ± 0.0014 Å |
c | 21.7343 ± 0.0011 Å |
α | 90° |
β | 90.144 ± 0.005° |
γ | 90° |
Cell volume | 8042.3 ± 0.7 Å3 |
Cell temperature | 123.01 ± 0.1 K |
Ambient diffraction temperature | 123.01 ± 0.1 K |
Number of distinct elements | 8 |
Space group number | 14 |
Hermann-Mauguin space group symbol | P 1 21/n 1 |
Hall space group symbol | -P 2yn |
Residual factor for all reflections | 0.0646 |
Residual factor for significantly intense reflections | 0.0468 |
Weighted residual factors for significantly intense reflections | 0.1304 |
Weighted residual factors for all reflections included in the refinement | 0.1633 |
Goodness-of-fit parameter for all reflections included in the refinement | 1.048 |
Diffraction radiation probe | x-ray |
Diffraction radiation wavelength | 1.54178 Å |
Diffraction radiation type | CuKα |