Information card for entry 7034168
Formula | C27 H28 Fe2 S |
Calculated formula | C27 H28 Fe2 S |
SMILES | [c]12([cH]3[cH]4[cH]5[cH]1[Fe]16782345[cH]2[cH]1[cH]6[cH]7[cH]82)C1([c]23[cH]4[cH]5[cH]6[cH]2[Fe]27893456[cH]3[cH]9[cH]8[cH]7[cH]23)CC(=C(CS1)C)C |
Title of publication | Synthesis and (spectro)electrochemistry of mixed-valent diferrocenyl-dihydrothiopyran derivatives. |
Authors of publication | Kowalski, Konrad; Karpowicz, Rafał; Mlostoń, Grzegorz; Miesel, Dominique; Hildebrandt, Alexander; Lang, Heinrich; Czerwieniec, Rafał; Therrien, Bruno |
Journal of publication | Dalton transactions (Cambridge, England : 2003) |
Year of publication | 2015 |
Journal volume | 44 |
Journal issue | 13 |
Pages of publication | 6268 - 6276 |
a | 9.7243 ± 0.0007 Å |
b | 13.7133 ± 0.001 Å |
c | 32.524 ± 0.002 Å |
α | 90° |
β | 90° |
γ | 90° |
Cell volume | 4337.1 ± 0.5 Å3 |
Cell temperature | 173 ± 2 K |
Ambient diffraction temperature | 173 ± 2 K |
Number of distinct elements | 4 |
Space group number | 61 |
Hermann-Mauguin space group symbol | P c a b |
Hall space group symbol | -P 2bc 2ac |
Residual factor for all reflections | 0.0835 |
Residual factor for significantly intense reflections | 0.0288 |
Weighted residual factors for significantly intense reflections | 0.0389 |
Weighted residual factors for all reflections included in the refinement | 0.0431 |
Goodness-of-fit parameter for all reflections included in the refinement | 0.599 |
Diffraction radiation wavelength | 0.71073 Å |
Diffraction radiation type | MoKα |