Information card for entry 7034193
Formula | C33 H46 N2 O P2 |
Calculated formula | C33 H46 N2 O P2 |
SMILES | P12P(C(=O)\C(N1c1c(C(C)C)cccc1C(C)C)=C/Nc1c(cccc1C(C)C)C(C)C)CC(=C(C2)C)C |
Title of publication | A stable phosphanyl phosphaketene and its reactivity. |
Authors of publication | Li, Zhongshu; Chen, Xiaodan; Bergeler, Maike; Reiher, Markus; Su, Cheng-Yong; Grützmacher, Hansjörg |
Journal of publication | Dalton transactions (Cambridge, England : 2003) |
Year of publication | 2015 |
Journal volume | 44 |
Journal issue | 14 |
Pages of publication | 6431 - 6438 |
a | 10.0689 ± 0.0011 Å |
b | 11.5642 ± 0.0012 Å |
c | 14.5238 ± 0.0016 Å |
α | 84.273 ± 0.003° |
β | 72.479 ± 0.003° |
γ | 76.618 ± 0.003° |
Cell volume | 1568.1 ± 0.3 Å3 |
Cell temperature | 100 K |
Ambient diffraction temperature | 100.8 K |
Number of distinct elements | 5 |
Space group number | 2 |
Hermann-Mauguin space group symbol | P -1 |
Hall space group symbol | -P 1 |
Residual factor for all reflections | 0.0398 |
Residual factor for significantly intense reflections | 0.0364 |
Weighted residual factors for significantly intense reflections | 0.0958 |
Weighted residual factors for all reflections included in the refinement | 0.0985 |
Goodness-of-fit parameter for all reflections included in the refinement | 1.022 |
Diffraction radiation wavelength | 0.71073 Å |
Diffraction radiation type | MoKα |