Information card for entry 7034200
Formula | C25 H34 Cl4 N2 O2 P2 Pd |
Calculated formula | C25 H34 Cl4 N2 O2 P2 Pd |
SMILES | [Pd]12([P](CC[P]1(CC)CC)(CC)CC)N(C(=O)N(C2=O)c1ccc(Cl)cc1)c1ccc(Cl)cc1.ClCCl |
Title of publication | Cyclic tetramers of a five-membered palladacycle based on a head-to-tail-linked isocyanate dimer and their reactivity in cyclotrimerization of isocyanates. |
Authors of publication | Lee, Seon Gye; Choi, Keun-Young; Kim, Yong-Joo; Park, SuJin; Lee, Soon W. |
Journal of publication | Dalton transactions (Cambridge, England : 2003) |
Year of publication | 2015 |
Journal volume | 44 |
Journal issue | 14 |
Pages of publication | 6537 - 6545 |
a | 13.1299 ± 0.0009 Å |
b | 11.2538 ± 0.0008 Å |
c | 20.6433 ± 0.0014 Å |
α | 90° |
β | 99.048 ± 0.002° |
γ | 90° |
Cell volume | 3012.3 ± 0.4 Å3 |
Cell temperature | 200 ± 2 K |
Ambient diffraction temperature | 200 ± 2 K |
Number of distinct elements | 7 |
Space group number | 14 |
Hermann-Mauguin space group symbol | P 1 21/n 1 |
Hall space group symbol | -P 2yn |
Residual factor for all reflections | 0.0684 |
Residual factor for significantly intense reflections | 0.0314 |
Weighted residual factors for significantly intense reflections | 0.0647 |
Weighted residual factors for all reflections included in the refinement | 0.0807 |
Goodness-of-fit parameter for all reflections included in the refinement | 1.002 |
Diffraction radiation wavelength | 0.71073 Å |
Diffraction radiation type | MoKα |