Information card for entry 7034201
Formula | C76 H40 Cl Cu3 O28 P2 Ru10 Te2 |
Calculated formula | C76 H40 Cl Cu3 O28 P2 Ru10 Te2 |
Title of publication | Copper-incorporated mono- and di-TeRu5 metal carbonyl complexes: syntheses, structures, and an unusual skeletal arrangement. |
Authors of publication | Shieh, Minghuey; Miu, Chia-Yeh; Hsing, Kai-Jieah; Jang, Li-Fing; Lin, Chien-Nan |
Journal of publication | Dalton transactions (Cambridge, England : 2003) |
Year of publication | 2015 |
Journal volume | 44 |
Journal issue | 14 |
Pages of publication | 6526 - 6536 |
a | 24.3922 ± 0.0006 Å |
b | 14.7256 ± 0.0003 Å |
c | 25.7278 ± 0.0007 Å |
α | 90° |
β | 110.132 ± 0.001° |
γ | 90° |
Cell volume | 8676.5 ± 0.4 Å3 |
Cell temperature | 298 ± 2 K |
Ambient diffraction temperature | 298 ± 2 K |
Number of distinct elements | 8 |
Space group number | 14 |
Hermann-Mauguin space group symbol | P 1 21/n 1 |
Hall space group symbol | -P 2yn |
Residual factor for all reflections | 0.1809 |
Residual factor for significantly intense reflections | 0.0913 |
Weighted residual factors for significantly intense reflections | 0.1901 |
Weighted residual factors for all reflections included in the refinement | 0.2313 |
Goodness-of-fit parameter for all reflections included in the refinement | 1.112 |
Diffraction radiation wavelength | 0.71073 Å |
Diffraction radiation type | MoKα |