Information card for entry 7034215
Formula | C7 H13 Mn2 N2 O12 P |
Calculated formula | C7 H13 Mn2 N2 O12 P |
Title of publication | Solvent-free synthesis of new inorganic-organic hybrid solids with finely tuned manganese oxalate structures. |
Authors of publication | Luan, Lindong; Li, Jing; Yin, Changzhen; Lin, Zhien; Huang, Hui |
Journal of publication | Dalton transactions (Cambridge, England : 2003) |
Year of publication | 2015 |
Journal volume | 44 |
Journal issue | 13 |
Pages of publication | 5974 - 5977 |
a | 15.8041 ± 0.0003 Å |
b | 16.2451 ± 0.0003 Å |
c | 11.5352 ± 0.0002 Å |
α | 90° |
β | 93.837 ± 0.002° |
γ | 90° |
Cell volume | 2954.9 ± 0.09 Å3 |
Cell temperature | 293 ± 2 K |
Ambient diffraction temperature | 293 ± 2 K |
Number of distinct elements | 6 |
Space group number | 14 |
Hermann-Mauguin space group symbol | P 1 21/c 1 |
Hall space group symbol | -P 2ybc |
Residual factor for all reflections | 0.0493 |
Residual factor for significantly intense reflections | 0.0437 |
Weighted residual factors for significantly intense reflections | 0.1157 |
Weighted residual factors for all reflections included in the refinement | 0.1202 |
Goodness-of-fit parameter for all reflections included in the refinement | 1.065 |
Diffraction radiation wavelength | 1.54184 Å |
Diffraction radiation type | CuKα |