Information card for entry 7034216
Formula | C7 H12 Mn2 N O12 P |
Calculated formula | C7 H7 Mn2 N O12 P |
Title of publication | Solvent-free synthesis of new inorganic-organic hybrid solids with finely tuned manganese oxalate structures. |
Authors of publication | Luan, Lindong; Li, Jing; Yin, Changzhen; Lin, Zhien; Huang, Hui |
Journal of publication | Dalton transactions (Cambridge, England : 2003) |
Year of publication | 2015 |
Journal volume | 44 |
Journal issue | 13 |
Pages of publication | 5974 - 5977 |
a | 11.6599 ± 0.0003 Å |
b | 10.9336 ± 0.0003 Å |
c | 11.7669 ± 0.0003 Å |
α | 90° |
β | 90° |
γ | 90° |
Cell volume | 1500.1 ± 0.07 Å3 |
Cell temperature | 293 ± 2 K |
Ambient diffraction temperature | 293 ± 2 K |
Number of distinct elements | 6 |
Space group number | 33 |
Hermann-Mauguin space group symbol | P n a 21 |
Hall space group symbol | P 2c -2n |
Residual factor for all reflections | 0.0587 |
Residual factor for significantly intense reflections | 0.0572 |
Weighted residual factors for significantly intense reflections | 0.1414 |
Weighted residual factors for all reflections included in the refinement | 0.1438 |
Goodness-of-fit parameter for all reflections included in the refinement | 1.066 |
Diffraction radiation wavelength | 1.54184 Å |
Diffraction radiation type | CuKα |