Information card for entry 7034219
Formula | C18 H27 N O2 Sn |
Calculated formula | C18 H27 N O2 Sn |
Title of publication | Synthesis of cyclic polyesters: effects of alkoxy side chains in salicylaldiminato tin(ii) complexes. |
Authors of publication | Wongmahasirikun, Phonpimon; Prom-On, Paweenuch; Sangtrirutnugul, Preeyanuch; Kongsaeree, Palangpon; Phomphrai, Khamphee |
Journal of publication | Dalton transactions (Cambridge, England : 2003) |
Year of publication | 2015 |
Journal volume | 44 |
Journal issue | 27 |
Pages of publication | 12357 - 12364 |
a | 17.2379 ± 0.0005 Å |
b | 10.4636 ± 0.0002 Å |
c | 10.0156 ± 0.0002 Å |
α | 90° |
β | 93.8814 ± 0.0008° |
γ | 90° |
Cell volume | 1802.38 ± 0.07 Å3 |
Cell temperature | 293 K |
Ambient diffraction temperature | 293 K |
Number of distinct elements | 5 |
Space group number | 14 |
Hermann-Mauguin space group symbol | P 1 21/c 1 |
Hall space group symbol | -P 2ybc |
Residual factor for all reflections | 0.0547 |
Residual factor for significantly intense reflections | 0.0499 |
Weighted residual factors for significantly intense reflections | 0.1446 |
Weighted residual factors for all reflections included in the refinement | 0.1477 |
Goodness-of-fit parameter for all reflections included in the refinement | 1.121 |
Diffraction radiation wavelength | 0.71073 Å |
Diffraction radiation type | MoKα |