Information card for entry 7034220
Formula | C13 H30 Cl3 Cu N |
Calculated formula | C13 H30 Cl3 Cu N |
Title of publication | An ionic liquid process for mercury removal from natural gas. |
Authors of publication | Abai, Mahpuzah; Atkins, Martin P.; Hassan, Amiruddin; Holbrey, John D.; Kuah, Yongcheun; Nockemann, Peter; Oliferenko, Alexander A.; Plechkova, Natalia V.; Rafeen, Syamzari; Rahman, Adam A.; Ramli, Rafin; Shariff, Shahidah M.; Seddon, Kenneth R.; Srinivasan, Geetha; Zou, Yiran |
Journal of publication | Dalton transactions (Cambridge, England : 2003) |
Year of publication | 2015 |
Journal volume | 44 |
Journal issue | 18 |
Pages of publication | 8617 - 8624 |
a | 9.2771 ± 0.0004 Å |
b | 15.6784 ± 0.0005 Å |
c | 12.5521 ± 0.0005 Å |
α | 90° |
β | 100.016 ± 0.002° |
γ | 90° |
Cell volume | 1797.88 ± 0.12 Å3 |
Cell temperature | 120 ± 2 K |
Ambient diffraction temperature | 120 K |
Number of distinct elements | 5 |
Space group number | 14 |
Hermann-Mauguin space group symbol | P 1 21/n 1 |
Hall space group symbol | -P 2yn |
Residual factor for all reflections | 0.0481 |
Residual factor for significantly intense reflections | 0.0377 |
Weighted residual factors for significantly intense reflections | 0.0898 |
Weighted residual factors for all reflections included in the refinement | 0.0951 |
Goodness-of-fit parameter for all reflections included in the refinement | 1.097 |
Diffraction radiation wavelength | 0.71073 Å |
Diffraction radiation type | MoKα |