Information card for entry 7034224
Formula | C16 H38 Cl3 O6 Sn Ta |
Calculated formula | C16 H38 Cl3 O6 Sn Ta |
SMILES | C(C)[O]1[Ta]2([O](CC)[Sn]1([O]2C(C)C)(Cl)(Cl)Cl)(OC(C)C)(OC(C)C)OC(C)C |
Title of publication | A convenient and quantitative route to Sn(iv)-M [M = Ti(iv), Nb(v), Ta(v)] heterobimetallic precursors for dense mixed-metal oxide ceramics. |
Authors of publication | Mishra, Shashank; Jeanneau, Erwann; Mangematin, Stéphane; Chermette, Henry; Poor Kalhor, Mahboubeh; Bonnefont, Guillaume; Fantozzi, Gilbert; Le Floch, Sylvie; Pailhes, Stéphane; Daniele, Stéphane |
Journal of publication | Dalton transactions (Cambridge, England : 2003) |
Year of publication | 2015 |
Journal volume | 44 |
Journal issue | 15 |
Pages of publication | 6848 - 6862 |
a | 10.505 ± 0.001 Å |
b | 14.763 ± 0.001 Å |
c | 17.79 ± 0.002 Å |
α | 90° |
β | 99.443 ± 0.009° |
γ | 90° |
Cell volume | 2721.6 ± 0.4 Å3 |
Cell temperature | 150 K |
Ambient diffraction temperature | 150 K |
Number of distinct elements | 6 |
Space group number | 14 |
Hermann-Mauguin space group symbol | P 1 21/n 1 |
Hall space group symbol | -P 2yn |
Residual factor for all reflections | 0.0931 |
Residual factor for significantly intense reflections | 0.0631 |
Weighted residual factors for all reflections | 0.1844 |
Weighted residual factors for significantly intense reflections | 0.1394 |
Weighted residual factors for all reflections included in the refinement | 0.1844 |
Goodness-of-fit parameter for all reflections included in the refinement | 0.9571 |
Diffraction radiation wavelength | 0.71069 Å |
Diffraction radiation type | MoKα |